�S���n�������c�̃R�[�h,ID,����,����_�J�i,����_�p��,���ݒn_�S���n�������c�̃R�[�h,����ID,���ݒn_�A���\�L,���ݒn_�s���{��,���ݒn_�s�撬��,���ݒn_����,���ݒn_�Ԓn�ȉ�,��������(����),�ܓx,�o�x,�W��,�d�b�ԍ�,�����ԍ�,�A���惁�[���A�h���X,�A����FormURL,�A������l�i���̑��ASNS�Ȃǁj,�X�֔ԍ�,�s�撬���R�[�h,�n�������c�̖�,�ЊQ���_�^��,�ЊQ���_�R����A�y�Η��y�ђn����,�ЊQ���_����,�ЊQ���_�n�k,�ЊQ���_�Ôg,�ЊQ���_��K�͂ȉΎ�,�ЊQ���_�����×�,�ЊQ���_�ΎR����,�w����Ƃ̏d��,�z����e�l��,�ΏۂƂȂ钬��E������,URL,�摜,�摜_���C�Z���X,���l
052027,1,�ُ鐼���w�Z�O���E���h,�e�C�W���E�j�V�V���E�K�b�R�E�O���E���h,,052027,,�H�c���\��s�Վᒬ2-1,�H�c��,�\��s,�Վᒬ,2-1,,40.210048,140.020411,,,,,,,,052027,�H�c���\��s,1,1,,1,,,,,,,,,,,�����ۖh�Њ�@�Ǘ���
052027,2,�ُ�쏬�w�Z�O���E���h,�e�C�W���E�~�i�~�V���E�K�b�R�E�O���E���h,,052027,,�H�c���\��s�ᏼ��2-24,�H�c��,�\��s,�ᏼ��,2-24,,40.205342,140.029255,,,,,,,,052027,�H�c���\��s,1,1,,1,1,,,,,,,,,,�����ۖh�Њ�@�Ǘ���
052027,3,��l���w�Z�O���E���h,�_�C�����V���E�K�b�R�E�O���E���h,,052027,,�H�c���\��s�����R3,�H�c��,�\��s,�����R,3,,40.187746,140.030942,,,,,,,,052027,�H�c���\��s,1,1,,1,1,,,,,,,,,,�����ۖh�Њ�@�Ǘ���
052027,4,�\���ꒆ�w�Z�O���E���h,�m�V���_�C�C�`�`���E�K�b�R�E�O���E���h,,052027,,�H�c���\��s�Վᒬ8-11,�H�c��,�\��s,�Վᒬ,8-11,,40.212331,140.016101,,,,,,,,052027,�H�c���\��s,1,1,,1,1,,,,,,,,,,�����ۖh�Њ�@�Ǘ���
052027,5,�\���񒆊w�Z�O���E���h,�m�V���_�C�j�`���E�K�b�R�E�O���E���h,,052027,,�H�c���\��s���L�ˑ�1-46,�H�c��,�\��s,���L�ˑ�,1-46,,40.194098,140.030838,,,,,,,,052027,�H�c���\��s,1,1,,1,1,,,,,,,,,,�����ۖh�Њ�@�Ǘ���
052027,6,�\�㏼�z�����w�Z�O���E���h,�m�V���V���E���E�R�E�g�E�K�b�R�E�O���E���h,,052027,,�H�c���\��s�Β�4-7,�H�c��,�\��s,�Β�,4-7,,40.196933,140.031611,,,,,,,,052027,�H�c���\��s,,1,,1,1,,,,,,,,,,�����ۖh�Њ�@�Ǘ���
052027,7,�\�㍂���w�Z�O���E���h,�m�V���R�E�g�E�K�b�R�E�O���E���h,,052027,,�H�c���\��s������2-1,�H�c��,�\��s,������,2-1,,40.183576,140.048840,,,,,,,,052027,�H�c���\��s,1,1,,1,1,,,,,,,,,,�����ۖh�Њ�@�Ǘ���
052027,8,���\��k�����w�Z,�L���E�m�V���L�^�R�E�g�E�K�b�R�E,,052027,,�H�c���\��s�Ǖ���1-36,�H�c��,�\��s,�Ǖ���,1-36,,40.204628,140.030775,,,,,,,,052027,�H�c���\��s,1,1,,1,1,,,,,,,,,,�����ۖh�Њ�@�Ǘ���
052027,9,�\��ӂꂠ���v���U,�m�V���t���A�C�v���U,,052027,,�H�c���\��s�㒬12-32,�H�c��,�\��s,�㒬,1-36,,40.212554,140.030762,,(0185)89-5530,,,,,,052027,�H�c���\��s,1,1,,1,1,,,,1,,,,,,�����ۖh�Њ�@�Ǘ���
052027,10,���������ٍL��,�`���E�I�E�R�E�~���J���q���o,,052027,,�H�c���\��s�Ǖ���4-26,�H�c��,�\��s,�Ǖ���,4-26,,40.202897,140.028339,,,,,,,,052027,�H�c���\��s,1,1,,1,1,,,,,,,,,,�����ۖh�Њ�@�Ǘ���
052027,11,�s�c���㋣�Z��,�V�G�C���N�W���E�L���E�M�W���E,,052027,,�H�c���\��s���L��66-1,�H�c��,�\��s,���L��,66-1,,40.210487,140.015438,,,,,,,,052027,�H�c���\��s,1,1,,1,,,,,,,,,,,�����ۖh�Њ�@�Ǘ���
052027,12,�\�����,�m�V���R�E�G��,,052027,,�H�c���\��s������25�O,�H�c��,�\��s,������,25�O,,40.211798,140.019656,,,,,,,,052027,�H�c���\��s,1,1,,1,1,,,,,,,,,,�����ۖh�Њ�@�Ǘ���
052027,13,�\��͔Ȍ���,�m�V���J�n���R�E�G��,,052027,,�H�c���\��s����136�O,�H�c��,�\��s,����,136�O,,40.215546,140.022911,,,,,,,,052027,�H�c���\��s,,1,,1,,,,,,,,,,,�����ۖh�Њ�@�Ǘ���
052027,14,��[�X�����,�J���o�^�K�C�N�R�E�G��,,052027,,�H�c���\��s����213�O,�H�c��,�\��s,����,213�O,,40.215957,140.031567,,,,,,,,052027,�H�c���\��s,,1,,1,,,,,,,,,,,�����ۖh�Њ�@�Ǘ���
052027,15,�咬�X�����,�I�I�}�`�K�C�N�R�E�G��,,052027,,�H�c���\��s�咬148-2�O,�H�c��,�\��s,�咬,148-2�O,,40.213872,140.027189,,,,,,,,052027,�H�c���\��s,1,1,,1,,,,,,,,,,,�����ۖh�Њ�@�Ǘ���
052027,16,�����ߗ׌���,�`���E�I�E�L�������R�E�G��,,052027,,�H�c���\��s�㒬152,�H�c��,�\��s,�㒬,152,,40.211432,140.025146,,,,,,,,052027,�H�c���\��s,1,1,,1,,,,,,,,,,,�����ۖh�Њ�@�Ǘ���
052027,17,�x���X�����,�g�~�`���E�K�C�N�R�E�G��,,052027,,�H�c���\��s�x��197,�H�c��,�\��s,�x��,197,,40.211045,140.030274,,,,,,,,052027,�H�c���\��s,1,1,,1,,,,,,,,,,,�����ۖh�Њ�@�Ǘ���
052027,18,�x�����X�����,�g�~�`���E�V���E�K�C�N�R�E�G��,,052027,,�H�c���\��s�x��193,�H�c��,�\��s,�x��,193,,40.210974,140.030269,,,,,,,,052027,�H�c���\��s,1,1,,1,,,,,,,,,,,�����ۖh�Њ�@�Ǘ���
052027,19,���X�����,�C�T�J�K�C�N�R�E�G��,,052027,,�H�c���\��s��w�쒬24�O,�H�c��,�\��s,��w�쒬,24�O,,40.210762,140.035857,,,,,,,,052027,�H�c���\��s,1,1,,1,1,,,,,,,,,,�����ۖh�Њ�@�Ǘ���
052027,20,�����X�����,���i�M�}�`�K�C�N�R�E�G��,,052027,,�H�c���\��s����167,�H�c��,�\��s,����,167,,40.208502,140.027728,,,,,,,,052027,�H�c���\��s,1,1,,1,,,,,,,,,,,�����ۖh�Њ�@�Ǘ���
052027,21,�o�˒��X�����,�f�g�}�`�K�C�N�R�E�G��,,052027,,�H�c���\��s���ʒ�172,�H�c��,�\��s,���ʒ�,172,,40.207951,140.022933,,,,,,,,052027,�H�c���\��s,1,1,,1,,,,,,,,,,,�����ۖh�Њ�@�Ǘ���
052027,22,�吳���X�����,�^�C�V���E�}�`�K�C�N�R�E�G��,,052027,,�H�c���\��s���L��273,�H�c��,�\��s,���L��,273,,40.207267,140.019873,,,,,,,,052027,�H�c���\��s,1,1,,1,1,,,,,,,,,,�����ۖh�Њ�@�Ǘ���
052027,23,���̑�X�����,�n�M�m�_�C�K�C�N�R�E�G��,,052027,,�H�c���\��s���L��298,�H�c��,�\��s,���L��,298,,40.207206,140.017378,,,,,,,,052027,�H�c���\��s,1,1,,1,1,,,,,,,,,,�����ۖh�Њ�@�Ǘ���
052027,24,�h���X�����,�T�J�G�`���E�K�C�N�R�E�G��,,052027,,�H�c���\��s�h��274,�H�c��,�\��s,�h��,274,,40.205905,140.023892,,,,,,,,052027,�H�c���\��s,1,1,,1,,,,,,,,,,,�����ۖh�Њ�@�Ǘ���
052027,25,���쒬�X�����,�V���E�i���}�`�K�C�N�R�E�G��,,052027,,�H�c���\��s���쒬113,�H�c��,�\��s,���쒬,113,,40.203888,140.020230,,,,,,,,052027,�H�c���\��s,1,1,,1,1,,,,,,,,,,�����ۖh�Њ�@�Ǘ���
052027,26,�ԉ��X�����,�n�i�]�m�K�C�N�R�E�G��,,052027,,�H�c���\��s�ԉ���1,�H�c��,�\��s,�ԉ���,1,,40.202734,140.023856,,,,,,,,052027,�H�c���\��s,1,1,,1,1,,,,,,,,,,�����ۖh�Њ�@�Ǘ���
052027,27,�o�ˊX�����,�f�g�K�C�N�R�E�G��,,052027,,�H�c���\��s�o�˖{��187,�H�c��,�\��s,�o�˖{��,187,,40.199454,140.024856,,,,,,,,052027,�H�c���\��s,1,1,,1,1,,,,,,,,,,�����ۖh�Њ�@�Ǘ���
052027,28,�o�ˏ��X�����,�f�g�V���E�K�C�N�R�E�G��,,052027,,�H�c���\��s�o�˖{��248,�H�c��,�\��s,�o�˖{��,248,,40.197954,140.026321,,,,,,,,052027,�H�c���\��s,1,1,,1,1,,,,,,,,,,�����ۖh�Њ�@�Ǘ���
052027,29,�������X�����,���C�W�}�`�K�C�N�R�E�G��,,052027,,�H�c���\��s������126,�H�c��,�\��s,������,126,,40.201044,140.034004,,,,,,,,052027,�H�c���\��s,,1,,1,1,,,,,,,,,,�����ۖh�Њ�@�Ǘ���
052027,30,�吣�X�����,�I�I�Z�K�C�N�R�E�G��,,052027,,�H�c���\��s���吣�ԉ�21-7,�H�c��,�\��s,���吣�ԉ�,21-7,,40.189140,140.035882,,,,,,,,052027,�H�c���\��s,,1,,1,1,,,,,,,,,,�����ۖh�Њ�@�Ǘ���
052027,31,���\�㏬�w�Z�O���E���h,���J�C�m�V���V���E�K�b�R�E�O���E���h,,052027,,�H�c���\��s���\�㎚���z25-1,�H�c��,�\��s,���\�㎚���z,25-1,,40.223495,140.035897,,,,,,,,052027,�H�c���\��s,1,1,,1,1,,,,,,,,,,�����ۖh�Њ�@�Ǘ���
052027,32,���_���w�Z�O���E���h,�V�m�m���`���E�K�b�R�E�O���E���h,,052027,,�H�c���\��s���\�㎚�g�g���L106-1,�H�c��,�\��s,���\�㎚�g�g���L,106-1,,40.225393,140.043667,,,,,,,,052027,�H�c���\��s,1,1,,1,1,,,,,,,,,,�����ۖh�Њ�@�Ǘ���
052027,33,���|�����w�Z�O���E���h,�L���E�^�R�E�V���E�K�b�R�E�O���E���h,,052027,,�H�c���\��s�|�����|��18-1,�H�c��,�\��s,�|�����|��,18-1,,40.257473,140.038997,,,,,,,,052027,�H�c���\��s,1,1,,1,1,,,,,,,,,,�����ۖh�Њ�@�Ǘ���
052027,34,���p�����w�Z�O���E���h,�L���E�z�m�L�Z�V���E�K�b�R�E�O���E���h,,052027,,�H�c���\��s�p������ё�65-1,�H�c��,�\��s,�p������ё�,65-1,,40.212147,140.084025,,,,,,,,052027,�H�c���\��s,1,1,,1,1,,,,,,,,,,�����ۖh�Њ�@�Ǘ���
052027,35,�����e���w�Z�O���E���h,�L���E�q�K�P�V���E�K�b�R�E�O���E���h,,052027,,�H�c���\��s�p�������e71-2,�H�c��,�\��s,�p�������e,71-2,,40.237823,140.082805,,,,,,,,052027,�H�c���\��s,1,1,,1,1,,,,,,,,,,�����ۖh�Њ�@�Ǘ���
052027,36,�\�㋅��O,�m�V���L���E�W���E�}�G,,052027,,�H�c���\��s����������3,�H�c��,�\��s,����������,3,,40.235661,140.017101,,,,,,,,052027,�H�c���\��s,1,1,,1,,,,,,,,,,,�����ۖh�Њ�@�Ǘ���
052027,37,�����u�X�����,���R�E�K�I�J�K�C�N�R�E�G��,,052027,,�H�c���\��s������������1-163,�H�c��,�\��s,������������,1-163,,40.227187,140.041341,,,,,,,,052027,�H�c���\��s,1,1,,1,1,,,,,,,,,,�����ۖh�Њ�@�Ǘ���
052027,38,�����P���X�����,�I�`�A�C�C�`�S�E�K�C�N�R�E�G��,,052027,,�H�c���\��s����������150,�H�c��,�\��s,����������,150,,40.229313,140.023386,,,,,,,,052027,�H�c���\��s,1,1,,1,,,,,,,,,,,�����ۖh�Њ�@�Ǘ���
052027,39,�����Q���X�����,�I�`�A�C�j�S�E�K�C�N�R�E�G��,,052027,,�H�c���\��s��������O�c198,�H�c��,�\��s,��������O�c,198,,40.226861,140.025129,,,,,,,,052027,�H�c���\��s,1,1,,1,,,,,,,,,,,�����ۖh�Њ�@�Ǘ���
052027,40,�����R���X�����,�I�`�A�C�T���S�E�K�C�N�R�E�G��,,052027,,�H�c���\��s���������O�c204,�H�c��,�\��s,���������O�c,204,,40.223729,140.025831,,,,,,,,052027,�H�c���\��s,1,1,,1,,,,,,,,,,,�����ۖh�Њ�@�Ǘ���
052027,41,�����S���X�����,�I�`�A�C�����S�E�K�C�N�R�E�G��,,052027,,�H�c���\��s�����������y150,�H�c��,�\��s,�����������y,150,,40.226073,140.021706,,,,,,,,052027,�H�c���\��s,1,1,,1,,,,,,,,,,,�����ۖh�Њ�@�Ǘ���
052027,42,�����T���X�����,�I�`�A�C�S�S�E�K�C�N�R�E�G��,,052027,,�H�c���\��s�������㊘�J�n280,�H�c��,�\��s,�������㊘�J�n,280,,40.226566,140.016482,,,,,,,,052027,�H�c���\��s,,1,,1,,,,,,,,,,,�����ۖh�Њ�@�Ǘ���
052027,43,�����ߗ׌���,�I�`�A�C�L�������R�E�G��,,052027,,�H�c���\��s�������Ê��J�n72,�H�c��,�\��s,�������Ê��J�n,72,,40.228732,140.017002,,,,,,,,052027,�H�c���\��s,1,1,,1,,,,,,,,,,,�����ۖh�Њ�@�Ǘ���
052027,44,�������Z��,�I�`�A�C�L���E�M�W���E,,052027,,�H�c���\��s�������È��y1-1,�H�c��,�\��s,�������È��y,1-1,,40.226365,140.013992,,,,,,,,052027,�H�c���\��s,,1,,1,,,,,,,,,,,�����ۖh�Њ�@�Ǘ���
052027,45,������񋅏�,�I�`�A�C�_�C�j�L���E�W���E,,052027,,�H�c���\��s�������È��y1-1,�H�c��,�\��s,�������È��y,1-1,,40.226497,140.012992,,,,,,,,052027,�H�c���\��s,,1,,1,,,,,,,,,,,�����ۖh�Њ�@�Ǘ���
052027,46,�\�t�g�{�[������,�\�t�g�{�[���W���E�_�C�C�`,,052027,,�H�c���\��s�������È��y1-1,�H�c��,�\��s,�������È��y,1-1,,40.227367,140.012509,,,,,,,,052027,�H�c���\��s,,1,,1,,,,,,,,,,,�����ۖh�Њ�@�Ǘ���
052027,47,�\�t�g�{�[������,�\�t�g�{�[���W���E�_�C�j,,052027,,�H�c���\��s�������È��y1-1,�H�c��,�\��s,�������È��y,1-1,,40.227207,140.012834,,,,,,,,052027,�H�c���\��s,,1,,1,,,,,,,,,,,�����ۖh�Њ�@�Ǘ���
052027,48,������w�Z�O���E���h,�A�T�i�C�V���E�K�b�R�E�O���E���h,,052027,,�H�c���\��s�������m�R236,�H�c��,�\��s,�������m�R,236,,40.160302,140.021922,,,,,,,,052027,�H�c���\��s,1,1,,1,1,,,,,,,,,,�����ۖh�Њ�@�Ǘ���
052027,49,�\��쒆�w�Z�O���E���h,�m�V���~�i�~�`���E�K�b�R�E�O���E���h,,052027,,�H�c���\��s�͌ː쎚����241,�H�c��,�\��s,�͌ː쎚����,241,,40.175362,140.028351,,,,,,,,052027,�H�c���\��s,1,1,,1,1,,,,,,,,,,�����ۖh�Њ�@�Ǘ���
052027,50,��܏��w�Z�O���E���h,�_�C�S�V���E�K�b�R�E�O���E���h,,052027,,�H�c���\��s�؟��������É��z25,�H�c��,�\��s,�؟��������É��z,25,,40.193219,140.080396,,,,,,,,052027,�H�c���\��s,,1,,1,1,,,,,,,,,,�����ۖh�Њ�@�Ǘ���
052027,51,�\�㓌���w�Z�O���E���h,�m�V���q�K�V�`���E�K�b�R�E�O���E���h,,052027,,�H�c���\��s��c������c251-1,�H�c��,�\��s,��c������c,251-1,,40.187489,140.093919,,,,,,,,052027,�H�c���\��s,1,1,,1,1,,,,,,,,,,�����ۖh�Њ�@�Ǘ���
052027,52,���������w�Z�O���E���h,�L���E�\�E�g�N�V���E�K�b�R�E�O���E���h,,052027,,�H�c���\��s�w�R�����c4-9,�H�c��,�\��s,�w�R�����c,4-9,,40.173502,140.109465,,,,,,,,052027,�H�c���\��s,1,,,1,1,,,,,,,,,,�����ۖh�Њ�@�Ǘ���
052027,53,���ߌ`���w�Z�O���E���h,�L���E�c���K�^�V���E�K�b�R�E�O���E���h,,052027,,�H�c���\��s������16,�H�c��,�\��s,������,16,,40.204195,140.118593,,,,,,,,052027,�H�c���\��s,1,,,1,1,,,,,,,,,,�����ۖh�Њ�@�Ǘ���
052027,54,����Տ��w�Z�O���E���h,�L���E�g�L���V���E�K�b�R�E�O���E���h,,052027,,�H�c���\��s��Վ�����90,�H�c��,�\��s,��Վ�����,90,,40.225607,140.138414,,,,,,,,052027,�H�c���\��s,,1,,1,1,,,,,,,,,,�����ۖh�Њ�@�Ǘ���
052027,55,����Ւ��w�Z�O���E���h,�L���E�g�L���`���E�K�b�R�E�O���E���h,,052027,,�H�c���\��s��Վ�����90,�H�c��,�\��s,��Վ�����,90,,40.225607,140.138414,,,,,,,,052027,�H�c���\��s,,1,,1,1,,,,,,,,,,�����ۖh�Њ�@�Ǘ���
052027,56,�c�m�򐶊����P�Z���^�[,�^�m�T���Z�C�J�c�J�C�[���Z���^�[,,052027,,�H�c���\��s��c�䒬�~�����l�̉�96-3,�H�c��,�\��s,��c�䒬�~�����l�̉�,96-3,,40.250440,140.196512,,,,,,,,052027,�H�c���\��s,1,,,,1,,,,,,,,,,�����ۖh�Њ�@�Ǘ���
052027,57,�唨������,�I�I�n�^�R�E�~���J��,,052027,,�H�c���\��s��c�䒬�~�����唨���Ԓn,�H�c��,�\��s,��c�䒬�~�����唨,���Ԓn,,40.283076,140.188334,,,,,,,,052027,�H�c���\��s,1,,,,1,,,,,,,,,,�����ۖh�Њ�@�Ǘ���
052027,58,�n�q�ЏW�,�o�b�R�_�C�V���E�J�C�V��,,052027,,�H�c���\��s��c�䒬�~�����n�q��48-1,�H�c��,�\��s,��c�䒬�~�����n�q��,48-1,,40.264163,140.192526,,,,,,,,052027,�H�c���\��s,1,,,,1,,,,,,,,,,�����ۖh�Њ�@�Ǘ���
052027,59,�基�D�m�ؕ���������,�I�I�u�`�h���m�L�u���N�R�E�~���J��,,052027,,�H�c���\��s��c�䒬�~�����������Ԓn,�H�c��,�\��s,��c�䒬�~��������,���Ԓn,,40.257539,140.192247,,,,,,,,052027,�H�c���\��s,1,,,,1,,,,,,,,,,�����ۖh�Њ�@�Ǘ���
052027,60,�~���ڗ����,�E���i�C�V���E���N�J�C�J��,,052027,,�H�c���\��s��c�䒬�~�����O�c160,�H�c��,�\��s,��c�䒬�~�����O�c,160,,40.238209,140.213109,,,,,,,,052027,�H�c���\��s,1,,,,1,,,,,,,,,,�����ۖh�Њ�@�Ǘ���
052027,61,���ˏW���c�_�Z���^�[,�A�N�h�V���E���N�G�C�m�E�Z���^�[,,052027,,�H�c���\��s��c�䒬�~��������V�c���Ԓn,�H�c��,�\��s,��c�䒬�~��������V�c,���Ԓn,,40.230064,140.196152,,,,,,,,052027,�H�c���\��s,,,,,1,,,,,,,,,,�����ۖh�Њ�@�Ǘ���
052027,62,�O�ʕ����W�(������),�\�g�I���e�u���N�V���E�J�C�V���i�W�h�E�J���j,,052027,,�H�c���\��s��c�䒬�펚�O��29-1,�H�c��,�\��s,��c�䒬�펚�O��,29-1,,40.213491,140.210593,,,,,,,,052027,�H�c���\��s,,1,,,1,,,,,,,,,,�����ۖh�Њ�@�Ǘ���
052027,63,����~���w�Z,�L���E�^�l�E���V���E�K�b�R�E,,052027,,�H�c���\��s��c�䒬�펚����m��15-1,�H�c��,�\��s,��c�䒬�펚����m��,15-1,,40.236180,140.217400,,,,,,,,052027,�H�c���\��s,1,1,,,1,,,,,,,,,,�����ۖh�Њ�@�Ǘ���
052027,64,����~���w�Z�O���E���h,�L���E�^�l�E���V���E�K�b�R�E�O���E���h,,052027,,�H�c���\��s��c�䒬��15-1,�H�c��,�\��s,��c�䒬��,15-1,,40.236199,140.216753,,,,,,,,052027,�H�c���\��s,1,1,,1,1,,,,,,,,,,�����ۖh�Њ�@�Ǘ���
052027,65,�������,�^�l�R�E�~���J��,,052027,,�H�c���\��s��c�䒬�펚�F�쓰�O145-2,�H�c��,�\��s,��c�䒬�펚�F�쓰�O,145-2,,40.226058,140.219568,,,,,,,,052027,�H�c���\��s,1,1,,,1,,,,,,,,,,�����ۖh�Њ�@�Ǘ���
052027,66,���J������,�J�}���R�E�~���J��,,052027,,�H�c���\��s��c�䒬�펚���J��o�����Ԓn,�H�c��,�\��s,��c�䒬�펚���J��o��,���Ԓn,,40.225280,140.202890,,,,,,,,052027,�H�c���\��s,,,,,1,,,,,,,,,,�����ۖh�Њ�@�Ǘ���
052027,67,���V�_���w�Z,�L���E�e���W���V���E�K�b�R�E,,052027,,�H�c���\��s��c�䒬���q���V�_����38-1,�H�c��,�\��s,��c�䒬���q���V�_����,38-1,,40.203479,140.259383,,,,,,,,052027,�H�c���\��s,,,,,1,,,,,,,,,,�����ۖh�Њ�@�Ǘ���
052027,68,���V�_���w�Z�O���E���h,�L���E�e���W���V���E�K�b�R�E�O���E���h,,052027,,�H�c���\��s��c�䒬���q���V�_����38-1,�H�c��,�\��s,��c�䒬���q���V�_����,38-1,,40.202799,140.258777,,,,,,,,052027,�H�c���\��s,,,,1,1,,,,,,,,,,�����ۖh�Њ�@�Ǘ���
052027,69,���̉w�ӂ���,�~�`�m�G�L�t�^�c�C,,052027,,�H�c���\��s��c�䒬���q����51,�H�c��,�\��s,��c�䒬���q����,51,,40.216244,140.259702,,,,,,,,052027,�H�c���\��s,,1,,1,1,,,,,,,,,,�����ۖh�Њ�@�Ǘ���
052027,70,�������,�A�\�E�J�C�J��,,052027,,�H�c���\��s��c�䒬����������46-1,�H�c��,�\��s,��c�䒬����������,46-1,,40.202713,140.265380,,,,,,,,052027,�H�c���\��s,,1,,,1,,,,,,,,,,�����ۖh�Њ�@�Ǘ���
052027,71,���c���W�,�Q�_�q���V���E�J�C�V��,,052027,,�H�c���\��s��c�䒬�������j�O54,�H�c��,�\��s,��c�䒬�������j�O,54,,40.204204,140.278898,,,,,,,,052027,�H�c���\��s,1,1,,,1,,,,,,,,,,�����ۖh�Њ�@�Ǘ���
052027,72,�ؐ΃R�~���j�e�B�Z���^�[,�L���C�V�R�~���j�e�B�Z���^�[,,052027,,�H�c���\��s��c�䒬�ؐΎ��R��64-4,�H�c��,�\��s,��c�䒬�ؐΎ��R��,64-4,,40.200230,140.210572,,,,,,,,052027,�H�c���\��s,1,1,,,1,,,,,,,,,,�����ۖh�Њ�@�Ǘ���
052027,73,�ؐΘV�l�W�,�L���C�V���E�W���V���E�J�C�V��,,052027,,�H�c���\��s��c�䒬�ؐΎ��R��61-1,�H�c��,�\��s,��c�䒬�ؐΎ��R��,61-1,,40.200050,140.211688,,,,,,,,052027,�H�c���\��s,1,,,,1,,,,,,,,,,�����ۖh�Њ�@�Ǘ���
052027,74,���ؐΏ��w�Z,�L���E�L���C�V�V���E�K�b�R�E,,052027,,�H�c���\��s��c�䒬�ؐΎ���q175,�H�c��,�\��s,��c�䒬�ؐΎ���q,175,,40.200922,140.208716,,,,,,,,052027,�H�c���\��s,1,1,,,1,,,,,,,,,,�����ۖh�Њ�@�Ǘ���
052027,75,���ؐΏ��w�Z�O���E���h,�L���E�L���C�V�V���E�K�b�R�E�O���E���h,,052027,,�H�c���\��s��c�䒬�ؐΎ���q175,�H�c��,�\��s,��c�䒬�ؐΎ���q,175,,40.201025,140.209370,,,,,,,,052027,�H�c���\��s,1,1,,1,1,,,,,,,,,,�����ۖh�Њ�@�Ǘ���
052027,76,�����Βn��W�,�J���}�^�C�V�`�N�V���E�J�C�V��,,052027,,�H�c���\��s��c�䒬�����Ύ����|112-1,�H�c��,�\��s,��c�䒬�����Ύ����|,112-1,,40.180014,140.195459,,,,,,,,052027,�H�c���\��s,1,1,,,1,,,,,,,,,,�����ۖh�Њ�@�Ǘ���
052027,77,���a�V�c�����W�,�V���E���V���f���u���N�V���E�J�C�V��,,052027,,�H�c���\��s��c�䒬�򍪎����������˖��Ԓn,�H�c��,�\��s,��c�䒬�򍪎�����������,���Ԓn,,40.219980,140.141795,,,,,,,,052027,�H�c���\��s,,1,,,1,,,,,,,,,,�����ۖh�Њ�@�Ǘ���
052027,78,�H���V�c�����W�,�n�_�`�V���f���u���N�V���E�J�C�V��,,052027,,�H�c���\��s��c�䒬�򍪎��H���V�c���Ԓn,�H�c��,�\��s,��c�䒬�򍪎��H���V�c,���Ԓn,,40.221595,140.145612,,,,,,,,052027,�H�c���\��s,,1,,,1,,,,,,,,,,�����ۖh�Њ�@�Ǘ���
052027,79,���x�����w�Z,�L���E�g�~�l�V���E�K�b�R�E,,052027,,�H�c���\��s��c�䒬�򍪎�������304,�H�c��,�\��s,��c�䒬�򍪎�������,304,,40.219904,140.165913,,,,,,,,052027,�H�c���\��s,,1,,,1,,,,,,,,,,�����ۖh�Њ�@�Ǘ���
052027,80,���x�����w�Z�O���E���h,�L���E�g�~�l�V���E�K�b�R�E�O���E���h,,052027,,�H�c���\��s��c�䒬�򍪎�������304,�H�c��,�\��s,��c�䒬�򍪎�������,304,,40.219216,140.165720,,,,,,,,052027,�H�c���\��s,,1,,1,1,,,,,,,,,,�����ۖh�Њ�@�Ǘ���
052027,81,�H���������,�n�_�`�u���N�J�C�J��,,052027,,�H�c���\��s��c�䒬�򍪎��H��169,�H�c��,�\��s,��c�䒬�򍪎��H��,169,,40.218178,140.157963,,,,,,,,052027,�H�c���\��s,,1,,,1,,,,,,,,,,�����ۖh�Њ�@�Ǘ���
052027,82,�x�c������,�g�~�^�R�E�~���J��,,052027,,�H�c���\��s��c�䒬�򍪎��x�c���Ԓn,�H�c��,�\��s,��c�䒬�򍪎��x�c,���Ԓn,,40.230093,140.174067,,,,,,,,052027,�H�c���\��s,,1,,,1,,,,,,,,,,�����ۖh�Њ�@�Ǘ���
052027,83,��ѕ����W�,�I�I�o���V�u���N�V���E�J�C�V��,,052027,,�H�c���\��s��c�䒬�򍪎���і��Ԓn,�H�c��,�\��s,��c�䒬�򍪎����,���Ԓn,,40.222880,140.189951,,,,,,,,052027,�H�c���\��s,,1,,,1,,,,,,,,,,�����ۖh�Њ�@�Ǘ���
052027,84,��`�����W�,�R�}�K�^�u���N�V���E�J�C�V��,,052027,,�H�c���\��s��c�䒬��`���o��115-2,�H�c��,�\��s,��c�䒬��`���o��,115-2,,40.216158,140.182441,,,,,,,,052027,�H�c���\��s,1,1,,,1,,,,,,,,,,�����ۖh�Њ�@�Ǘ���
052027,85,���W�,���U�L�V���E�J�C�V��,,052027,,�H�c���\��s��c�䒬��`����薳�Ԓn,�H�c��,�\��s,��c�䒬��`�����,���Ԓn,,40.213978,140.178123,,,,,,,,052027,�H�c���\��s,1,1,,,1,,,,,,,,,,�����ۖh�Њ�@�Ǘ���
052027,86,�j�c�䒆�w�Z�O���E���h,�t�^�c�C�`���E�K�b�R�E�O���E���h,,052027,,�H�c���\��s��c�䒬������76-2,�H�c��,�\��s,��c�䒬������,76-2,,40.206135,140.235598,,,,,,,,052027,�H�c���\��s,,1,,1,1,,,,,,,,,,�����ۖh�Њ�@�Ǘ���
052027,87,�\�㍂���w�Z�莞���ے��O���E���h,�m�V���R�E�g�E�K�b�R�E�e�C�W�Z�C�J�e�C�O���E���h,,052027,,�H�c���\��s��c�䒬���ܐ犡20-1,�H�c��,�\��s,��c�䒬���ܐ犡,20-1,,40.214641,140.241570,,,,,,,,052027,�H�c���\��s,,1,,1,1,,,,,,,,,,�����ۖh�Њ�@�Ǘ���
052027,88,�j�c�䏬�w�Z�O���E���h,�t�^�c�C�V���E�K�b�R�E�O���E���h,,052027,,�H�c���\��s��c�䒬�����25-1,�H�c��,�\��s,��c�䒬�����,25-1,,40.202940,140.230686,,,,,,,,052027,�H�c���\��s,,1,,1,1,,,,,,,,,,�����ۖh�Њ�@�Ǘ���
052027,89,���j�c�䏬�w�Z�O���E���h,�L���E�t�^�c�C�V���E�K�b�R�E�O���E���h,,052027,,�H�c���\��s��c�䒬�����ǎq��[40-1,�H�c��,�\��s,��c�䒬�����ǎq��[,40-1,,40.211009,140.243703,,,,,,,,052027,�H�c���\��s,,1,,1,1,,,,,,,,,,�����ۖh�Њ�@�Ǘ���
052027,90,�j�c�䎙����,�t�^�c�C�W�h�E�J��,,052027,,�H�c���\��s��c�䒬������ƌ�82-2,�H�c��,�\��s,��c�䒬������ƌ�,82-2,,40.208578,140.237843,,,,,,,,052027,�H�c���\��s,,1,,,1,,,,,,,,,,�����ۖh�Њ�@�Ǘ���
052027,91,��c�䋅��,�t�^�c�C�L���E�W���E,,052027,,�H�c���\��s��c�䒬���B�쌴113,�H�c��,�\��s,��c�䒬���B�쌴,113,,40.197650,140.224466,,,,,,,,052027,�H�c���\��s,,1,,1,1,,,,,,,,,,�����ۖh�Њ�@�Ǘ���
052027,92,���Â݌���,�T�N���d�c�~�R�E�G��,,052027,,�H�c���\��s��c�䒬�׏��đ��E��,�H�c��,�\��s,��c�䒬�׏��đ��E��,,,40.216986,140.248668,,,,,,,,052027,�H�c���\��s,,1,,1,1,,,,,,,,,,�����ۖh�Њ�@�Ǘ���
052027,93,���m�����w�Z,�L���E�j�u�i�V���E�K�b�R�E,,052027,,�H�c���\��s��c�䒬�m������R52-1,�H�c��,�\��s,��c�䒬�m������R,52-1,,40.191447,140.229976,,,,,,,,052027,�H�c���\��s,1,,,,1,,,,,,,,,,�����ۖh�Њ�@�Ǘ���
052027,94,���m�����w�Z�O���E���h,�L���E�j�u�i�V���E�K�b�R�E�O���E���h,,052027,,�H�c���\��s��c�䒬�m������R52-1,�H�c��,�\��s,��c�䒬�m������R,52-1,,40.191395,140.230444,,,,,,,,052027,�H�c���\��s,1,,,1,1,,,,,,,,,,�����ۖh�Њ�@�Ǘ���
052027,95,�m�������W�,�j�u�i�u���N�V���E�J�C�V��,,052027,,�H�c���\��s��c�䒬�m�����ƌ㖳�Ԓn,�H�c��,�\��s,��c�䒬�m�����ƌ�,���Ԓn,,40.191772,140.228258,,,,,,,,052027,�H�c���\��s,1,1,,,1,,,,,,,,,,�����ۖh�Њ�@�Ǘ���
052027,96,���䎩�����,�i�J�_�C�W�`�J�C�J��,,052027,,�H�c���\��s��c�䒬�m�������䖳�Ԓn,�H�c��,�\��s,��c�䒬�m��������,���Ԓn,,40.196255,140.234851,,,,,,,,052027,�H�c���\��s,1,,,,1,,,,,,,,,,�����ۖh�Њ�@�Ǘ���
052027,97,�S�_������,�I�j�K�~�R�E�~���J��,,052027,,�H�c���\��s��c�䒬���|��������22-1,�H�c��,�\��s,��c�䒬���|��������,22-1,,40.174010,140.228140,,,,,,,,052027,�H�c���\��s,1,,,,1,,,,,,,,,,�����ۖh�Њ�@�Ǘ���
052027,98,���|�������,�R�K�P�u���N�J�C�J��,,052027,,�H�c���\��s��c�䒬���|�����c�\2,�H�c��,�\��s,��c�䒬���|�����c�\,2,,40.179142,140.220416,,,,,,,,052027,�H�c���\��s,1,,,,1,,,,,,,,,,�����ۖh�Њ�@�Ǘ���
052027,99,�j�c������ّ��앪��,�t�^�c�C�R�E�~���J���j�S���J���u���J��,,052027,,�H�c���\��s��c�䒬���쎚����145-1,�H�c��,�\��s,��c�䒬���쎚����,145-1,,40.109863,140.200353,,,,,,,,052027,�H�c���\��s,1,,,,1,,,,,,,,,,�����ۖh�Њ�@�Ǘ���
052027,100,�c��㕔���W�,�^�V���J�~�u���N�V���E�J�C�V��,,052027,,�H�c���\��s��c�䒬�c�㎚���򖳔Ԓn,�H�c��,�\��s,��c�䒬�c�㎚����,���Ԓn,,40.095988,140.237319,,,,,,,,052027,�H�c���\��s,1,1,,,1,,,,,,,,,,�����ۖh�Њ�@�Ǘ���
052027,101,���c�㏬�w�Z,�L���E�^�V���V���E�K�b�R�E,,052027,,�H�c���\��s��c�䒬�c�㎚�D�m�ؑ�212,�H�c��,�\��s,��c�䒬�c�㎚�D�m�ؑ�,212,,40.109172,140.228757,,,,,,,,052027,�H�c���\��s,1,1,,,1,,,,,,,,,,�����ۖh�Њ�@�Ǘ���
052027,102,���c�㏬�w�Z�O���E���h,�L���E�^�V���V���E�K�b�R�E�O���E���h,,052027,,�H�c���\��s��c�䒬�c�㎚�D�m�ؑ�212,�H�c��,�\��s,��c�䒬�c�㎚�D�m�ؑ�,212,,40.109516,140.228580,,,,,,,,052027,�H�c���\��s,1,1,,1,1,,,,,,,,,,�����ۖh�Њ�@�Ǘ���
052027,103,�c�㐶�����P�Z���^�[,�^�V���Z�C�J�c�J�C�[���Z���^�[,,052027,,�H�c���\��s��c�䒬�c�㎚�D�m�ؑ�122-1,�H�c��,�\��s,��c�䒬�c�㎚�D�m�ؑ�,122-1,,40.110764,140.227349,,,,,,,,052027,�H�c���\��s,1,,,,1,,,,,,,,,,�����ۖh�Њ�@�Ǘ���
052027,104,�{�c��W�,�z���^�V���V���E�J�C�V��,,052027,,�H�c���\��s��c�䒬�c�㎚�Ӗ��ؑ�73-3,�H�c��,�\��s,��c�䒬�c�㎚�Ӗ��ؑ�,73-3,,40.122648,140.229363,,,,,,,,052027,�H�c���\��s,1,1,,,1,,,,,,,,,,�����ۖh�Њ�@�Ǘ���
052027,105,�ُ鐼���w�Z,�e�C�W���E�j�V�V���E�K�b�R�E,,052027,,�H�c���\��s�Վᒬ2-1,�H�c��,�\��s,�Վᒬ,2-1,,40.210102,140.021632,,(0185)52-2237,,,,,,052027,�H�c���\��s,1,1,,1,1,,,,1,,,,,,�����ۖh�Њ�@�Ǘ���
052027,106,�ُ�쏬�w�Z,�e�C�W���E�~�i�~�V���E�K�b�R�E,,052027,,�H�c���\��s�ᏼ��2-24,�H�c��,�\��s,�ᏼ��,2-24,,40.205561,140.028993,,(0185)52-5329,,,,,,052027,�H�c���\��s,1,1,,1,1,,,,1,,,,,,�����ۖh�Њ�@�Ǘ���
052027,107,��l���w�Z,�_�C�����V���E�K�b�R�E,,052027,,�H�c���\��s�����R3,�H�c��,�\��s,�����R,3,,40.187498,140.030983,,(0185)52-3239,,,,,,052027,�H�c���\��s,1,1,,1,1,,,,1,,,,,,�����ۖh�Њ�@�Ǘ���
052027,108,�\���ꒆ�w�Z,�m�V���_�C�C�`�`���E�K�b�R�E,,052027,,�H�c���\��s�Վᒬ8-11,�H�c��,�\��s,�Վᒬ,8-11,,40.212483,140.015819,,(0185)52-2227,,,,,,052027,�H�c���\��s,1,1,,1,1,,,,1,,,,,,�����ۖh�Њ�@�Ǘ���
052027,109,�\���񒆊w�Z,�m�V���_�C�j�`���E�K�b�R�E,,052027,,�H�c���\��s���L�ˑ�1-46,�H�c��,�\��s,���L�ˑ�,1-46,,40.193602,140.030419,,(0185)52-5138,,,,,,052027,�H�c���\��s,1,1,,1,1,,,,1,,,,,,�����ۖh�Њ�@�Ǘ���
052027,110,�\�㏼�z�����w�Z,�m�V���V���E���E�R�E�g�E�K�b�R�E,,052027,,�H�c���\��s�Β�4-7,�H�c��,�\��s,�Β�,4-7,,40.196559,140.032147,,(0185)89-2021,,,,,,052027,�H�c���\��s,1,1,,1,1,,,,1,,,,,,�����ۖh�Њ�@�Ǘ���
052027,111,�\�㍂���w�Z,�m�V���R�E�g�E�K�b�R�E,,052027,,�H�c���\��s������2-1,�H�c��,�\��s,������,2-1,,40.182582,140.048717,,(0185)54-2230,,,,,,052027,�H�c���\��s,1,1,,1,1,,,,1,,,,,,�����ۖh�Њ�@�Ǘ���
052027,112,�\��Ȋw�Z�p�����w�Z,�m�V���J�K�N�M�W���c�R�E�g�E�K�b�R�E,,052027,,�H�c���\��s�Վᒬ3-1,�H�c��,�\��s,�Վᒬ,3-1,,40.210703,140.020653,,(0185)74-5701,,,,,,052027,�H�c���\��s,1,1,,1,1,,,,1,,,,,,�����ۖh�Њ�@�Ǘ���
052027,113,�\��s�����̈��,�m�V���V�\�E�S�E�^�C�C�N�J��,,052027,,�H�c���\��s�咬9-53,�H�c��,�\��s,�咬,9-53,,40.216076,140.026974,,(0185)54-3607,,,,,,052027,�H�c���\��s,,1,,1,,,,,1,,,,,,�����ۖh�Њ�@�Ǘ���
052027,114,�������,�u���J�J�C�J��,,052027,,�H�c���\��s�Ǖ���4-26,�H�c��,�\��s,�Ǖ���,4-26,,40.202897,140.028339,,(0185)54-8141,,,,,,052027,�H�c���\��s,1,1,,1,1,,,,1,,,,,,�����ۖh�Њ�@�Ǘ���
052027,115,�ΘJ���N�z�[��,�L�����E�Z�C�V���E�l���z�[��,,052027,,�H�c���\��s�Ǖ���4-26,�H�c��,�\��s,�Ǖ���,4-26,,40.202866,140.029264,,(0185)55-1585,,,,,,052027,�H�c���\��s,1,1,,1,1,,,,1,,,,,,�����ۖh�Њ�@�Ǘ���
052027,116,�L��𗬃Z���^�[,�R�E�C�L�R�E�����E�Z���^�[,,052027,,�H�c���\��s���C�r��3-2,�H�c��,�\��s,���C�r��,3-2,,40.188831,140.009745,,(0185)54-5300,,,,,,052027,�H�c���\��s,1,,,1,1,,,,1,,,,,,�����ۖh�Њ�@�Ǘ���