�S���n�������c�̃R�[�h,�@�l�ԍ�,ID,�n�������c�̖�,�C�x���g��,����R�[�h,�C�x���g�ʏ�,�T�u�^�C�g��,�C�x���g��_�J�i,�C�x���g��_�p��,�R���e���cURL,���,�L�[���[�h,�^�O,�ΏۂƂȂ�Y��,�J�Ãp�^�[��,�J�n��,�I����,�J�n����,�I������,�J�n�������L����,���v����,�f�ڊJ�n��,�f�ڏI����,�T�v,����,�T�u�C�x���g,�C�x���g���,����(��{),����(�ڍ�),�A���於��,�A����d�b�ԍ�,�A��������ԍ�,��Î�,���Òc��,�֘A�g�D,�Ώێ�,�ΏێҔ��l,�ꏊ����,�W���i��t�j�ꏊ,���ݒn_�S���n�������c�̃R�[�h,����ID,���ݒn_�A���\�L,���ݒn_�s���{��,���ݒn_�s�撬��,���ݒn_����,���ݒn_�Ԓn�ȉ�,��������(����),�ܓx,�o�x,�A�N�Z�X���@,���ԏ���,���ԏꗿ��,���֏���,Web�J��,Web�J��URL,�c�[���E��,���,������l,�������,���ώ��,�O����Ή�,�O����Ή����l,�J�Ï���,�Q���\���I����,�Q���\���I������,�Q���\�����@,�\���J�n��,�\���J�n����,�\��URL,URL,������,���ނւ��R�[�i�[,���H��,�x�r�[�J�[�ݏo,�x�r�[�J�[���p,�摜,�摜_���C�Z���X,���l
052027,,,�H�c���\��s,�\��J�b�v���Z�I���o�X�P�b�g�{�[�����,,,,�m�V���J�b�v�R�E�R�E�Z���o�c�o�X�P�b�g�{�[���^�C�J�C,,,,,,,,2023-05-03,2023-05-05,09:00,18:00,,,,,,�\��J�b�v�́A���N5��3���`5���ɍs����o�X�P�b�g�{�[�����B���Z�j�q5�`�[���̃��[�O��ŗD���𑈂��܂��B,,,,,,,,,,,,,�\��s�����̈��,,052027,,�H�c���\��s�咬9-53,�H�c��,�\��s,�咬,9-53,,40.216076,140.026974,,,,,,,,,,,,,,,,,,,,,,,,,,,,,�s�����͐��i�ۃo�X�P�̊X�Â��萄�i�S��
052027,,,�H�c���\��s,���g�_�В��̐\�Տ��Ձ@�Ō��܂�,,,,�q���V�W���W���i�J�m�T���T�C���C�}�c���@�����~�}�c��,,,,,,,,2023-05-27,2023-05-27,16:00,19:00,,,,,,�Ō��܂�́A���g�_�Ђ̐\�Ղ̏��Ղ̍s���ŁA����4���̒��̐\�̑O���ɍs���܂��B,,,,,,,,,,,,,���g�_��,,052027,,�H�c���\��s��w�쒬3-24,�H�c��,�\��s,��w�쒬,3-24,,40.211591,140.036786,,,,,,,,,,,,,,,,,,,,,,,,,,,,,�ό��U���ۊό��U���W
052027,,,�H�c���\��s,�`�܂�\��̉ԉ�,,,,�~�i�g�}�c���m�V���m�n�i�r,,,,,,,,,,19:30,21:00,,,,,,"�\��̉ԉ΂́A��15,000�������y�ɂ̂��đł��グ��G���^���R���T�[�g�ԉ΃V���[�ł��B",,,,,,,,,,,,,�\��`���l�u��,,052027,,�H�c���\��s�\�㒬���l,�H�c��,�\��s,�\�㒬���l,,,40.216900,140.011075,,,,,,,,,,,,,,,,,,,,,,,,,,,,,�ό��U���ۊό��U���W
052027,,,�H�c���\��s,�\�㎵�[�u�V��̕s���v,,,,�m�V���^�i�o�^�u�e���N�E�m�t���W���E�v,,,,,,,,,,18:00,21:30,,,,,,�u�V��̕s���v�Ƃ́A2013�N�ɖ�P���I�̎����o�ĕ��������A��^���Ă��g���\�㎵�[�ł��B,,,,,,,,,,,,,����101��,,052027,,�H�c���\��s����,�H�c��,�\��s,����,,,,,,,,,,,,,,,,,,,,,,,,,,,,,,,,,�ό��U���ۊό��U���W
052027,,,�H�c���\��s,���݂܂�����܂�,,,,�L�~�}�`�T�J�T�N���}�c��,,,,,,,,2023-04-10,2023-04-30,,,,,,,,,,,,,,,,,,,,,���݂܂���,,052027,,�H�c���\��s��c�䒬���q����,�H�c��,�\��s,��c�䒬���q����,,,40.218195,140.254369,,,,,,,,,,,,,,,,,,,,,,,,,,,,,��c�䒬�ό�����
052027,,,�H�c���\��s,���݂܂�����܂�,,,,�L�~�}�`�T�J�c�c�W�}�c��,,,,,,,,2023-05-01,2023-05-31,,,,,,,,,,,,,,,,,,,,,���݂܂���,,052027,,�H�c���\��s��c�䒬���q����,�H�c��,�\��s,��c�䒬���q����,,,40.218195,140.254369,,,,,,,,,,,,,,,,,,,,,,,,,,,,,��c�䒬�ό�����
052027,,,�H�c���\��s,���݂܂���g�t�܂�,,,,�L�~�}�`�T�J�R�E���E�}�c��,,,,,,,,,,,,,,,,,,,,,,,,,,,,,,���݂܂���,,052027,,�H�c���\��s��c�䒬���q����,�H�c��,�\��s,��c�䒬���q����,,,40.218195,140.254369,,,,,,,,,,,,,,,,,,,,,,,,,,,,,��c�䒬�ό�����
052027,,,�H�c���\��s,�\������[�E�V���`����,,,,�m�V�����N�^�i�o�^�E�V���`�i�K�V,�@,,,,,,,,,,,,,,,,,,,,,,,,,,,,,�\��s,,052027,,�H�c���\��s,�H�c��,�\��s,,,,,,,,,,,,,,,,,,,,,,,,,,,,,,,,,,�\��ό�����
052027,,,�H�c���\��s,���ǂ����[,,,,�R�h���^�i�o�^,,,,,,,,,,,,,,,,,,,,,,,,,,,,,,�\��s,,052027,,�H�c���\��s,�H�c��,�\��s,,,,,,,,,,,,,,,,,,,,,,,,,,,,,,,,,,�\��ό�����
052027,,,�H�c���\��s,���݂܂��̗��t�F�X�e�B�o���i��c��}���\���E���Y�t�F�A�j,,,,�L�~�}�`�m�T�g�t�F�X�e�B�o���i�t�^�c�C�}���\���E�u�b�T���t�F�A�j,,,,,,,,2023-10-14,2023-10-15,,,,,,,,,,,,,,,,,,,,,��c�䒬�����̈��,,052027,,�H�c���\��s��c�䒬�����60,�H�c��,�\��s,��c�䒬�����,60,,40.203699,140.233573,,,,,,,,,,,,,,,,,,,,,,,,,,,,,���Y�Ɖۊ��Y�ƌW�A���U�w�K�E�X�|�[�c�U���ۃX�|�[�c�U���W
052027,,,�H�c���\��s,�\������t�܂�i������j,,,,�m�V���R�E�G���n���}�c���i�T�N���j,,,,,,,,2023-04-10,2023-05-05,,,,,,,,,,,,,,,,,,,,,�\�����,,052027,,�H�c���\��s������25�O,�H�c��,�\��s,������,25�O,,40.211798,140.019656,,,,,,,,,,,,,,,,,,,,,,,,,,,,,�\��ό�����
052027,,,�H�c���\��s,�\������t�܂�i���j,,,,�m�V���R�E�G���n���}�c���i�c�c�W�j,,,,,,,,2023-05-06,2023-05-31,,,,,,,,,,,,,,,,,,,,,�\�����,,052027,,�H�c���\��s������25�O,�H�c��,�\��s,������,25�O,,40.211798,140.019656,,,,,,,,,,,,,,,,,,,,,,,,,,,,,�\��ό�����
052027,,,�H�c���\��s,�H�c���̗���c��܂�,,,,�A�L�^�X�M�m�T�g�t�^�c�C�}�c��,,,,,,,,2023-07-15,2023-07-16,10:00,16:00,,,,,,�H�c���łł����؍H�i�Ȃǂ̒n����Y�i�̓W��������J�Â���܂��B,,,�@,,,,,,,,,,���̉w�ӂ���,,052027,,�H�c���\��s��c�䒬���q����51,�H�c��,�\��s,��c�䒬���q����,51,,40.216244,140.259702,,,,,,,,,,,,,,,,,,,,,,,,,,,,,���Y�Ɖۊ��Y�ƌW
