�S���n�������c�̃R�[�h,ID,�n�������c�̖�,����,����_�J�i,����_�p��,����_�ʏ�,POI�R�[�h,�O�����ʎq,�O�����ʎq�̒l,���ݒn_�S���n�������c�̃R�[�h,����ID,���ݒn_�A���\�L,���ݒn_�s���{��,���ݒn_�s�撬��,���ݒn_����,���ݒn_�Ԓn�ȉ�,��������(����),�ܓx,�o�x,���x�̎��,���x�̒l,�d�b�ԍ�,�����ԍ�,�A���惁�[���A�h���X,�A����FormURL,�A������l�i���̑��ASNS�Ȃǁj,�X�֔ԍ�,�@�l�ԍ�,�c�̖�,���p�\�j��,�J�n����,�I������,���p�\���ԓ��L����,����,�Ԉ֎q��,�Ԉ֎q�ݏo,�c�G�ݏo,�o���A�t���[�g�C��,�X���[�v�A�G���x�[�^�A�G�X�J���[�^,�_���u���b�N���̈ړ��x��,�_����Ǐ�ɂ��x��,�ӓ����E����A����������,����,�M�k�Ή�,�D�撓�ԏ�,�I�X�g���C�g�Ή��g�C��,������,���ނւ��R�[�i�[,���H��,�x�r�[�J�[�ݏo,�x�r�[�J�[���p,URL,�摜,�摜_���C�Z���X,���l
052027,,�H�c���\��s,�\��s�����{����,�m�V���V���N�V���z���`���E�V��,,,,,,052027,,�H�c���\��s�㒬1-3,�H�c��,�\��s,�㒬,1-3,,40.212000,140.027339,,,(0185)52-2111,,,,,,,�\��s,���ΐ��؋�,08:30,17:15,�j���A1��29������1��3���܂ł͕����B,1�K�s���𗬃X�y�[�X�L��,,,,,,,,,,,,,,,,,,,,,�����ۍs���W�D�撓�ԏ�L��;���ړI�g�C���L��;�Ԉ֎q�ݏo�L��;�ӓ����E����E������������;�X���[�v�L��;�i������;�G���x�[�^�[�L��;�肷��L��
052027,,�H�c���\��s,�\��s������c�䒬����,�m�V���V���N�V���t�^�c�C�}�`�`���E�V��,,,,,,052027,,�H�c���\��s��c�䒬�����1-1,�H�c��,�\��s,��c�䒬�����,1-1,,40.205594,140.231942,,,(0185)73-2111,,,,,,,�\��s,���ΐ��؋�,08:30,17:15,�j���A1��29������1��3���܂ł͕����B,,,,,,,,,,,,,,,,,,,,,,�������ۑ������W�D�撓�ԏ�L��;���ړI�g�C���L��;�Ԉ֎q�ݏo�L��;�ӓ����E����E������������;�X���[�v�L��;�i������;�G���x�[�^�[�L��;�肷��L��
052027,,�H�c���\��s,�x���o����,�g�~�l�V���b�`���E�V��,,,,,,052027,,�H�c���\��s��c�䒬�򍪎��O�c33-3,�H�c��,�\��s,��c�䒬�򍪎��O�c,33-3,,40.221675,140.167426,,,(0185)75-2111,,,,,,,�\��s,���ΐ��؋�,08:30,17:15,,,,,,,,,,,,,,,,,,,,,,,�������ۑ������W
052027,,�H�c���\��s,����������,�`���E�I�E�R�E�~���J��,,,,,,052027,,�H�c���\��s�Ǖ���4-26,�H�c��,�\��s,�Ǖ���,4-26,,40.202897,140.028339,,,(0185)54-8141,,,,,,,NPO�@�l�\��s�|�p��������,�����ΐ��؋��y,09:00,22:00,12��29������1��3���܂ł͋x�ٓ��B�i���̑��Ǘ���K�v�ȓ��j,,,,,,,,,,,,,,,,,,,,,,���U�w�K�E�X�|�[�c�U���ی����ٕ����W
052027,,�H�c���\��s,����������,�g�E�u�R�E�~���J��,,,,,,052027,,�H�c���\��s��c�����n155-1,�H�c��,�\��s,��c�����n,155-1,,40.194177,140.088867,,,(0185)58-3100,,,,,,,�\��s����ψ���,�����ΐ��؋��y,09:00,22:00,12��29������1��3���܂ł͋x�ٓ��B,��n��Z���^�[�A������ٕ��݁B,,,,,,,,,,,,,,,,,,,,,���U�w�K�E�X�|�[�c�U���ی����ٕ����W
052027,,�H�c���\��s,�암������,�i���u�R�E�~���J��,,,,,,052027,,�H�c���\��s�͌ː쎚���c134-1,�H�c��,�\��s,�͌ː쎚���c,134-1,,40.175618,140.027705,,,(0185)89-2324,,,,,,,�\��s����ψ���,�����ΐ��؋��y,09:00,22:00,12��29������1��3���܂ł͋x�ٓ��B,��n��Z���^�[���݁B,,,,,,,,,,,,,,,,,,,,,���U�w�K�E�X�|�[�c�U���ی����ٕ����W
052027,,�H�c���\��s,���\�������,���J�C�m�V���R�E�~���J��,,,,,,052027,,�H�c���\��s���\�㎚���z83,�H�c��,�\��s,���\�㎚���z,83,,40.221991,140.034694,,,(0185)52-2324,,,,,,,�\��s����ψ���,�����ΐ��؋��y,09:00,22:00,12��29������1��3���܂ł͋x�ٓ��B,���\��n��Z���^�[���݁B,,,,,,,,,,,,,,,,,,,,,���U�w�K�E�X�|�[�c�U���ی����ٕ����W
052027,,�H�c���\��s,�w�R������,�q���}�R�E�~���J��,,,,,,052027,,�H�c���\��s�w�R�����R��104,�H�c��,�\��s,�w�R�����R��,104,,40.169793,140.113058,,,(0185)58-3101,,,,,,,�\��s����ψ���,�����ΐ��؋��y,09:00,22:00,12��29������1��3���܂ł͋x�ٓ��B,�w�R�n��Z���^�[���݁B,,,,,,,,,,,,,,,,,,,,,���U�w�K�E�X�|�[�c�U���ی����ٕ����W
052027,,�H�c���\��s,�ߌ`������,�c���K�^�R�E�~���J��,,,,,,052027,,�H�c���\��s������16,�H�c��,�\��s,������,16,,40.205834,140.116821,,,(0185)58-3211,,,,,,,�\��s����ψ���,�����ΐ��؋��y,09:00,22:00,12��29������1��3���܂ł͋x�ٓ��B,�ߌ^�n��Z���^�[���݁B,,,,,,,,,,,,,,,,,,,,,���U�w�K�E�X�|�[�c�U���ی����ٕ����W
052027,,�H�c���\��s,��Ռ�����,�g�L���R�E�~���J��,,,,,,052027,,�H�c���\��s��Վ�����90,�H�c��,�\��s,��Վ�����,90,,40.225341,140.137811,,,(0185)59-2111,,,,,,,�\��s����ψ���,�����ΐ��؋��y,09:00,22:00,12��29������1��3���܂ł͋x�ٓ��B,��Ւn��Z���^�[���݁B,,,,,,,,,,,,,,,,,,,,,���U�w�K�E�X�|�[�c�U���ی����ٕ����W
052027,,�H�c���\��s,��c�������,�t�^�c�C�R�E�~���J��,,,,,,052027,,�H�c���\��s��c�䒬������ƌ�49,�H�c��,�\��s,��c�䒬������ƌ�,49,,40.207263,140.238855,,,(0185)73-2590,,,,,,,�����c�������@�l�@�X�|�J�����݂܂�,�����ΐ��؋��y,09:00,22:00,12��29������1��3���܂ł͋x�ٓ��B,,,,,,,,,,,,,,,,,,,,,,���U�w�K�E�X�|�[�c�U���ی����ٕ����W
052027,,�H�c���\��s,��c������ٓ�c�䕪��,�t�^�c�C�R�E�~���J���t�^�c�C�u���J��,,,,,,052027,,�H�c���\��s��c�䒬���O�犡3-3,�H�c��,�\��s,��c�䒬���O�犡,3-3,,40.211675,140.240149,,,(0185)73-4093,,,,,,,�����c�������@�l�@�X�|�J�����݂܂�,�����ΐ��؋��y,09:00,22:00,12��29������1��3���܂ł͋x�ٓ��B,,,,,,,,,,,,,,,,,,,,,,���U�w�K�E�X�|�[�c�U���ی����ٕ����W
052027,,�H�c���\��s,�ی��Z���^�[,�z�P���Z���^�[,,,,,,052027,,�H�c���\��s�����كm��19-3,�H�c��,�\��s,�����كm��,19-3,,40.178363,140.073168,,,(0185)58-2838,,,,,,,�\��s,���ΐ��؋�,,,�j���A1��29������1��3���܂ł͕����B,,,,,,,,,,,,,,,,,,,,,,���N�Â���ی��N���W
052027,,�H�c���\��s,�ߌ`�f�Ï�,�c���K�^�V�������E�W��,,,,,,052027,,�H�c���\��s������16�i�ߌ`�n��Z���^�[���j,�H�c��,�\��s,������,16,�i�ߌ`�n��Z���^�[���j,40.205834,140.116821,,,(0185)58-3211,,,,,,,�\��s,,14:30,16:30,��2�E��4�Ηj���ɊJ��,,,,,,,,,,,,,,,,,,,,,,���N�Â���ی��N���W
052027,,�H�c���\��s,��Րf�Ï�,�g�L���V�������E�W��,,,,,,052027,,�H�c���\��s��Վ���{��158,�H�c��,�\��s,��Վ���{��,158,,40.228077,140.141424,,,(0185)59-2006,,,,,,,�\��s,��,13:00,15:00,,,,,,,,,,,,,,,,,,,,,,,���N�Â���ی��N���W
052027,,�H�c���\��s,�x���f�Ï�,�g�~�l�V�������E�W��,,,,,,052027,,�H�c���\��s��c�䒬�򍪎��O�c33-3,�H�c��,�\��s,��c�䒬�򍪎��O�c,33-3,,40.221675,140.167426,,,(0185)75-2222,,,,,,,�\��s,��,08:00,10:30,,,,,,,,,,,,,,,,,,,,,,,�s�������ێs�������W
052027,,�H�c���\��s,�_�ƋZ�p�Z���^�[,�m�E�M���E�M�W���c�Z���^�[,,,,,,052027,,�H�c���\��s���\�㎚�g�g���L108-1,�H�c��,�\��s,���\�㎚�g�g���L,108-1,,40.225056,140.045980,,,(0185)52-2247,,,,,,,�\��s,���ΐ��؋�,09:00,16:00,�j���A12��29������1��3���܂ł͕����B,,,,,,,,,,,,,,,,,,,,,,�_�ƋZ�p�Z���^�[
052027,,�H�c���\��s,�\��s�������,�m�V���V�u���J�J�C�J��,,,,,,052027,,�H�c���\��s�Ǖ���4-26,�H�c��,�\��s,�Ǖ���,4-26,,40.202897,140.028339,,,(0185)54-8141,,,,,,,NPO�@�l�\��s�|�p��������,�������؋��y,,,,,,,,,,,,,,,,,,,,,,,,,���U�w�K�E�X�|�[�c�U���ی����ٕ����W
052027,,�H�c���\��s,�ΘJ���N�z�[��,�L�����E�Z�C�V���E�l���z�[��,,,,,,052027,,�H�c���\��s�Ǖ���4-26,�H�c��,�\��s,�Ǖ���,4-26,,40.202866,140.029264,,,(0185)55-1585,,,,,,,NPO�@�l�\��s�|�p��������,���ΐ��؋��y,09:00,22:00,�j���A12��29������1��3���܂ł͋x�ٓ��B,,,,,,,,,,,,,,,,,,,,,,���U�w�K�E�X�|�[�c�U���ی����ٕ����W
052027,,�H�c���\��s,�����w�l�̉�,�n�^���N�t�W���m�C�G,,,,,,052027,,�H�c���\��s�Ǖ���4-26,�H�c��,�\��s,�Ǖ���,4-26,,40.202781,140.029742,,,(0185)54-8210,,,,,,,NPO�@�l�\��s�|�p��������,���ΐ��؋��y,09:00,22:00,�j���A12��29������1��3���܂ł͋x�ٓ��B,,,,,,,,,,,,,,,,,,,,,,���U�w�K�E�X�|�[�c�U���ی����ٕ����W
052027,,�H�c���\��s,���L�O��,�C�T�J�L�l���J��,,,,,,052027,,�H�c���\��s��w�쒬3-25,�H�c��,�\��s,��w�쒬,3-25,,40.210927,140.035912,,,(0185)73-5285,,,,,,,�\��s����ψ���,�Ζؓy,09:00,16:00,4������10���܂Ł��\�����݂�����΁A���ł��J�ق��܂��B,,,,,,,,,,,,,,,,,,,,,,���U�w�K�E�X�|�[�c�U���ې��U�w�K�W
052027,,�H�c���\��s,�\��s�����̈��,�m�V���V�\�E�S�E�^�C�C�N�J��,,,,,,052027,,�H�c���\��s�咬9-53,�H�c��,�\��s,�咬,9-53,,40.216076,140.026974,,,(0185)54-3607,,,,,,,NPO�@�l�\��s�X�|�[�c����,�����ΐ��؋��y,09:00,21:30,12��28������1��4���܂ł͋x�ٓ��B,,,,,,,,,,,,,,,,,,,,,,���U�w�K�E�X�|�[�c�U���ې��U�w�K�W
052027,,�H�c���\��s,��c�䒬�����̈��,�t�^�c�C�}�`�\�E�S�E�^�C�C�N�J��,,,,,,052027,,�H�c���\��s��c�䒬�����60,�H�c��,�\��s,��c�䒬�����,60,,40.203699,140.233573,,,(0185)73-6111,,,,,,,NPO�@�l�\��s�X�|�[�c����,�����ΐ��؋��y,09:00,21:30,12��29������1��3���܂ł͋x�ٓ�,,,,,,,,,,,,,,,,,,,,,,���U�w�K�E�X�|�[�c�U���ۃX�|�[�c�U���W
052027,,�H�c���\��s,�׏��̈��,�j�A�Q�o�^�C�C�N�J��,,,,,,052027,,�H�c���\��s��c�䒬�׏�ꎚ��ǎq�o��1-1,�H�c��,�\��s,��c�䒬�׏�ꎚ��ǎq�o��,1-1,,40.219020,140.245413,,,(0185)73-3772,,,,,,,NPO�@�l�\��s�X�|�[�c����,���ΐ��؋��y,09:00,21:30,12��29������1��3���܂ł͋x�ٓ�,,,,,,,,,,,,,,,,,,,,,,���U�w�K�E�X�|�[�c�U���ۃX�|�[�c�U���W
052027,,�H�c���\��s,�\��s�y���̈��,�m�V���V�c�`���J�^�C�C�N�J��,,,,,,052027,,�H�c���\��s�������T�J�n1-65,�H�c��,�\��s,�������T�J�n,1-65,,40.232720,140.012557,,,(0185)54-4419,,,,,,,NPO�@�l�\��s�X�|�[�c����,�����ΐ��؋��y,09:00,21:30,12��28������1��4���܂ł͋x�ٓ��B,,,,,,,,,,,,,,,,,,,,,,���U�w�K�E�X�|�[�c�U���ۃX�|�[�c�U���W
052027,,�H�c���\��s,�\��s�a���f�C�m�Z���^�[,�m�V���V�r�[�A���h�W�[�J�C���E�Z���^�[,,,,,,052027,,�H�c���\��s�������T�J�n1-65,�H�c��,�\��s,�������T�J�n,1-65,,40.233289,140.013157,,,(0185)54-4419,,,,,,,NPO�@�l�\��s�X�|�[�c����,�����ΐ��؋��y,09:00,21:30,12��29������1��3���܂ł͋x�ٓ��B,,,,,,,,,,,,,,,,,,,,,,���U�w�K�E�X�|�[�c�U���ۃX�|�[�c�U���W
052027,,�H�c���\��s,�\�㋅��,�m�V���L���E�W���E,,,,,,052027,,�H�c���\��s����������3,�H�c��,�\��s,����������,3,,40.235661,140.017101,,,(0185)54-8994,,,,,,,NPO�@�l�\��s�X�|�[�c����,�����ΐ��؋��y,09:00,17:00,4�����y�j������10��31���܂ŁB�@��2�E4�Ηj���͋x�ٓ��B,,,,,,,,,,,,,,,,,,,,,,���U�w�K�E�X�|�[�c�U���ۃX�|�[�c�U���W
052027,,�H�c���\��s,�ԏ�����,�A�J�k�}�L���E�W���E,,,,,,052027,,�H�c���\��s������ԏ�236,�H�c��,�\��s,������ԏ�,236,,40.170891,140.013190,,,(0185)54-3607,,,,,,,NPO�@�l�\��s�X�|�[�c����,�����ΐ��؋��y,05:00,19:00,4�����y�j������10��31���܂ŁB�@,,,,,,,,,,,,,,,,,,,,,,���U�w�K�E�X�|�[�c�U���ۃX�|�[�c�U���W
052027,,�H�c���\��s,���M������,�Z�C�z�E�G���L���E�W���E,,,,,,052027,,�H�c���\��s����������2�̓�,�H�c��,�\��s,����������,2�̓�,,40.232979,140.016278,,,(0185)54-3607,,,,,,,NPO�@�l�\��s�X�|�[�c����,�����ΐ��؋��y,05:00,19:00,4��1������11��30���܂ŁB,,,,,,,,,,,,,,,,,,,,,,���U�w�K�E�X�|�[�c�U���ۃX�|�[�c�U���W
052027,,�H�c���\��s,������ꋅ��,�I�`�A�C�_�C�C�`�L���E�W���E,,,,,,052027,,�H�c���\��s����������2�̓�,�H�c��,�\��s,����������,2�̓�,,40.230695,140.015923,,,(0185)54-3607,,,,,,,NPO�@�l�\��s�X�|�[�c����,�����ΐ��؋��y,05:00,19:00,4��1������11��30���܂ŁB,,,,,,,,,,,,,,,,,,,,,,���U�w�K�E�X�|�[�c�U���ۃX�|�[�c�U���W
052027,,�H�c���\��s,������񋅏�,�I�`�A�C�_�C�j�L���E�W���E,,,,,,052027,,�H�c���\��s�������È���1,�H�c��,�\��s,�������È���,1,,40.226497,140.012992,,,(0185)54-3607,,,,,,,NPO�@�l�\��s�X�|�[�c����,�����ΐ��؋��y,05:00,19:00,,,,,,,,,,,,,,,,,,,,,,,���U�w�K�E�X�|�[�c�U���ۃX�|�[�c�U���W
052027,,�H�c���\��s,�\��s���㋣�Z��,�m�V���V���N�W���E�L���E�M�W���E,,,,,,052027,,�H�c���\��s���L��66-1,�H�c��,�\��s,���L��,66-1,,40.210487,140.015438,,,(0185)52-1085,,,,,,,NPO�@�l�\��s�X�|�[�c����,�����ΐ��؋��y,07:00,19:00,"3��1������11��30���܂ŁB
5��1������9��30����7:00����20:00�܂ŁB",,,,,,,,,,,,,,,,,,,,,,���U�w�K�E�X�|�[�c�U���ۃX�|�[�c�U���W
052027,,�H�c���\��s,�����e�j�X�R�[�g,�I�`�A�C�e�j�X�R�[�g,,,,,,052027,,�H�c���\��s�������T�J�n1-65,�H�c��,�\��s,�������T�J�n,1-65,,40.233747,140.012345,,,(0185)54-4419,,,,,,,NPO�@�l�\��s�X�|�[�c����,�����ΐ��؋��y,09:00,21:00,4��1������11��30���܂ŁB,,,,,,,,,,,,,,,,,,,,,,���U�w�K�E�X�|�[�c�U���ۃX�|�[�c�U���W
052027,,�H�c���\��s,�����e�j�X�R�[�g,�R�E�G���e�j�X�R�[�g,,,,,,052027,,�H�c���\��s�Վᒬ64-39,�H�c��,�\��s,�Վᒬ,64-39,,40.212033,140.018054,,,(0185)54-3607,,,,,,,NPO�@�l�\��s�X�|�[�c����,�����ΐ��؋��y,05:00,19:00,4��1������11��30���܂ŁB,,,,,,,,,,,,,,,,,,,,,,���U�w�K�E�X�|�[�c�U���ۃX�|�[�c�U���W
052027,,�H�c���\��s,��c�䋅��,�t�^�c�C�L���E�W���E,,,,,,052027,,�H�c���\��s��c�䒬���B�쌴113,�H�c��,�\��s,��c�䒬���B�쌴,113,,40.197650,140.224466,,,(0185)73-6111,,,,,,,NPO�@�l�\��s�X�|�[�c����,�����ΐ��؋��y,05:00,19:00,4����1�y�j������10��31���܂ŁB,,,,,,,,,,,,,,,,,,,,,,���U�w�K�E�X�|�[�c�U���ۃX�|�[�c�U���W
052027,,�H�c���\��s,��c��e�j�X�R�[�g,�t�^�c�C�e�j�X�R�[�g,,,,,,052027,,�H�c���\��s��c�䒬���ǎq��[40-1,�H�c��,�\��s,��c�䒬���ǎq��[,40-1,,40.211018,140.243671,,,(0185)73-5016,,,,,,,NPO�@�l�\��s�X�|�[�c����,���ΐ��؋��y,09:00,21:00,4��1������11��30���܂ŁB,,,,,,,,,,,,,,,,,,,,,,���U�w�K�E�X�|�[�c�U���ۃX�|�[�c�U���W
052027,,�H�c���\��s,�\��s���v�[��,�m�V���V�~���v�[��,,,,,,052027,,�H�c���\��s����8-50,�H�c��,�\��s,����,8-50,,40.215478,140.028078,,,(0185)54-9445,,,,,,,NPO�@�l�\��s�X�|�[�c����,�������؋��y,13:00,19:00,������4����3�y�j������9��30�܂ŁB���O��7��1������8��31���܂ł̐���25�x�ȏ�̓��B7��23������8��25���܂ł͖��x�B�y���j����10:00�`19:00�i7��23������8��25���͉�����10:00�`20:00�@���O��10:00�`���v�j,,,,,,,,,,,,,,,,,,,,,,���U�w�K�E�X�|�[�c�U���ۃX�|�[�c�U���W
052027,,�H�c���\��s,�\��s���\��}����,�m�V���V���c�m�V���g�V���J��,,,,,,052027,,�H�c���\��s�Ǖ���4-26,�H�c��,�\��s,�Ǖ���,4-26,,40.202255,140.029605,,,(0185)54-1114,,,,,,,������Ё@�}���ٗ��ʃZ���^�[,���ΐ��؋��y,09:00,19:00,12��29������1��4���A�����������i����1���B�������A�y�j���y�ѓ��j���������B�j�͋x�ٓ��B,,,,,,,,,,,,,,,,,,,,,,���U�w�K�E�X�|�[�c�U���ۃX�|�[�c�U���W
052027,,�H�c���\��s,�\��s����c��}����,�m�V���V���c�t�^�c�C�g�V���J��,,,,,,052027,,�H�c���\��s��c�䒬�����1-1�@��c�䒬����3�K,�H�c��,�\��s,��c�䒬�����,1-1,��c�䒬����3�K,40.205594,140.231942,,,(0185)88-8853,,,,,,,�\��s����ψ���,���ΐ��؋��y,09:00,19:00,12��29������1��4���A�����������i����1���B�������A�y�j���y�ѓ��j���������B�j�͋x�ٓ��B,,,,,,,,,,,,,,,,,,,,,,���U�w�K�E�X�|�[�c�U���ۃX�|�[�c�U���W
052027,,�H�c���\��s,�\��s�q�ǂ��فi�T�C�G���X�p�[�N�j,�m�V���V�R�h���J���i�T�C�G���X�p�[�N�j,,,,,,052027,,�H�c���\��s�咬10-1,�H�c��,�\��s,�咬,10-1,,40.216377,140.024813,,,(0185)52-1277,,,,,,,�\��s,���ΐ��؋��y,09:00,17:00,��4���j���i�j���������j�A�j���̗����A12��28������1��4���͋x�ٓ��B,,,,,,,,,,,,,,,,,,,,,,���U�w�K�E�X�|�[�c�U���ۃX�|�[�c�U���W
052027,,�H�c���\��s,�\��s�|����,�m�V���V�L���E�h�E�W���E,,,,,,052027,,�H�c���\��s�������T�J�n1-65,�H�c��,�\��s,�������T�J�n,1-65,,40.232999,140.013159,,,(0185)54-4419,,,,,,,NPO�@�l�\��s�X�|�[�c����,�������؋��y,09:00,21:30,,,,,,,,,,,,,,,,,,,,,,,���U�w�K�E�X�|�[�c�U���ۃX�|�[�c�U���W
052027,,�H�c���\��s,�������Z��,�I�`�A�C�L���E�W���E,,,,,,052027,,�H�c���\��s�������È���1,�H�c��,�\��s,�������È���,1,,40.226365,140.013992,,,(0185)54-3607,,,,,,,NPO�@�l�\��s�X�|�[�c����,�����ΐ��؋��y,05:00,19:00,,,,,,,,,,,,,,,,,,,,,,,���U�w�K�E�X�|�[�c�U���ۃX�|�[�c�U���W
052027,,�H�c���\��s,�\�t�g�{�[������,�\�t�g�{�[���W���E�_�C�C�`,,,,,,052027,,�H�c���\��s�������È���1,�H�c��,�\��s,�������È���,1,,40.227367,140.012509,,,(0185)54-3607,,,,,,,NPO�@�l�\��s�X�|�[�c����,�����ΐ��؋��y,05:00,19:00,,,,,,,,,,,,,,,,,,,,,,,���U�w�K�E�X�|�[�c�U���ۃX�|�[�c�U���W
052027,,�H�c���\��s,�\�t�g�{�[������,�\�t�g�{�[���W���E�_�C�j,,,,,,052027,,�H�c���\��s�������È���1,�H�c��,�\��s,�������È���,1,,40.227207,140.012834,,,(0185)54-3607,,,,,,,NPO�@�l�\��s�X�|�[�c����,�����ΐ��؋��y,05:00,19:00,,,,,,,,,,,,,,,,,,,,,,,���U�w�K�E�X�|�[�c�U���ۃX�|�[�c�U���W
052027,,�H�c���\��s,�T���E�E�b�h�\��,�T���E�E�b�h�m�V��,,,,,,052027,,�H�c���\��s���̑�1-28,�H�c��,�\��s,���̑�,1-28,,40.207128,140.016106,,,(0185)52-3121,,,,,,,�\��s����ψ���,�����ΐ��؋��y,09:00,22:00,12��29������1��3���܂ł͋x�ٓ��B,,,,,,,,,,,,,,,,,,,,,,�\�㋳�玖����
052027,,�H�c���\��s,�ۍ╟����فi�������j,�z�T�J�t�N�V�J�C�J���i�V���E�W���G���j,,,,,,052027,,�H�c���\��s�Ǖ���4-26,�H�c��,�\��s,�Ǖ���,4-26,,40.202094,140.029847,,,(0185)54-8465,,,,,016-0842,,�\��s,���ΐ��؋��y,08:30,17:15,12��29������1��3���܂ł͋x�ٓ��B,,��,��,,��,,,,,,,��,,,,��,,,,,,�������������ے����Љ�W
052027,,�H�c���\��s,����җF���Z���^�[�E�W��𗬎��i�\��ӂꂠ���v���U2�K�j,�R�E���C�V�����E�A�C�Z���^�[�E�V���E�J�C�R�E�����E�V�c�i�m�V���t���A�C�v���U�j�J�C�j,,,,,,052027,,�H�c���\��s�㒬12-32,�H�c��,�\��s,�㒬,12-32,,40.212554,140.030762,,,(0185)89-5530,,,,,,,�\��s,�����ΐ��؋��y,08:30,22:00,12��29������1��3���܂ł͋x�ٓ��B,,,,,,,,,,,,,,,,,,,,,,�s���������\��ӂꂠ���v���U
052027,,�H�c���\��s,�V�l�e�̉Ɓi�������j,���E�W���C�R�C�m�C�G�i�n�N�g�E�e�C�j,,,,,,052027,,�H�c���\��s��������J1-1,�H�c��,�\��s,��������J,1-1,,40.236785,140.013929,,,(0185)54-1650,,,,,016-0014,,�\��s,���ΐ��؋��y,09:00,17:00,�j���̗����A12��29������1��3���܂ł͋x�ٓ��B,,��,��,,,,,,,,,��,,,,��,,,,,,�������������ے����Љ�W
052027,,�H�c���\��s,����҂ӂꂠ���𗬎{��,�R�E���C�V���t���A�C�R�E�����E�V�Z�c,,,,,,052027,,�H�c���\��s��c�䒬������ƌ�97,�H�c��,�\��s,��c�䒬������ƌ�,97,,40.208689,140.238496,,,(0185)88-8426,,,,,,,�\��s,���ΐ��؋��y,09:00,21:00,12��29������1��3���܂ŋx�ٓ��B,,,,,,,,,,,,,,,,,,,,,,�s�������ێs�������W
052027,,�H�c���\��s,��c��`���z�[��,�t�^�c�C�f���V���E�z�[��,,,,,,052027,,�H�c���\��s��c�䒬�����1-1,�H�c��,�\��s,��c�䒬�����,1-1,,40.205647,140.232581,,,(0185)74-6040,,,,,,,�\��s����ψ���,�����ΐ��؋��y,09:00,22:00,12��29������1��3���܂ŋx�ٓ��B,,,,,,,,,,,,,,,,,,,,,,���U�w�K�E�X�|�[�c�U���ې��U�w�K�W
052027,,�H�c���\��s,�_�ы��ƕw�l�������i�{�݁i���z�[���Ђт��j,�m�E�����M���J�t�W���J�c�h�E�\�N�V���V�Z�c�i�X�M�z�[���q�r�L�j,,,,,,052027,,�H�c���\��s��c�䒬�m������R38-2,�H�c��,�\��s,��c�䒬�m������R,38-2,,40.192241,140.229073,,,(0185)73-3891,,,,,,,�m������,�����ΐ��؋��y,09:00,22:00,12��29������1��3���܂ŋx�ٓ��B,,,,,,,,,,,,,,,,,,,,,,���U�w�K�E�X�|�[�c�U���ې��U�w�K�W
052027,,�H�c���\��s,��~�ӂ邳�Ƃ̉�,�^�l�E���t���T�g�m�C�G,,,,,,052027,,�H�c���\��s��c�䒬�펚����m��167,�H�c��,�\��s,��c�䒬�펚����m��,167,,40.236298,140.216241,,,(0185)73-4500,,,,,,,��m��������,�����ΐ��؋��y,08:30,22:00,,,,,,,,,,,,,,,,,,,,,,,���Y�Ɖۊ��Y�ƌW
052027,,�H�c���\��s,�u�i�̐X�ӂꂠ���`����,�u�i�m�����t���A�C�f���V���E�J��,,,,,,052027,,�H�c���\��s��c�䒬�򍪎�������391,�H�c��,�\��s,��c�䒬�򍪎�������,391,,40.218446,140.166536,,,(0185)75-2380,,,,,,,�x���n�拦�c��,�������؋��y,08:30,22:00,,,,,,,,,,,,,,,,,,,,,,,���Y�Ɖۊ��Y�ƌW
052027,,�H�c���\��s,�ӂ������_���y�̐X,�t�^�c�C�V���J�~�L���E�h�m����,,,,,,052027,,,,,,,,,,,,(0185)73-4500,,,,,,,�\��s,�����ΐ��؋��y,00:00,00:00,11�����{����5����{�͋x�e���y�уg�C������B,,,,,,,,,,,,,,,,,,,,,,���Y�Ɖۊ��Y�ƌW
052027,,�H�c���\��s,�\��s�֏�,�m�V���V�T�C�W���E,,,,,,052027,,�H�c���\��s���̑�10-7,�H�c��,�\��s,���̑�,10-7,,40.201710,140.016560,,,(0185)52-4551,,,,,,,�\��s,�����ΐ��؋��y,08:30,17:00,1��1���͕ٓ��B,,,,,,,,,,,,,,,,,,,,,,���q���ۊ��q���W
052027,,�H�c���\��s,�\��s��ʔp�����ŏI������,�m�V���V�C�b�p���n�C�L�u�c�T�C�V���E�V���u���W���E,,,,,,052027,,�H�c���\��s�p�������e57�Ԓn175�O,�H�c��,�\��s,�p�������e,57�Ԓn175�O,,40.229924,140.077990,,,(0185)55-0454,,,,,,,�\��s,�����ΐ��؋��y,09:00,16:30,1��1������1��3���܂ŕ��B,,,,,,,,,,,,,,,,,,,,,,���q���ې��|�W
052027,,�H�c���\��s,�\��s���������E,�L���E�����E�e�C�J�l���E,,,,,,052027,,�H�c���\��s����13-8,�H�c��,�\��s,����,13-8,,40.208915,140.025774,,,(0185)55-3355,,,,,,,�\��s�������X�X�U���g��,�����ΐ��؋��y,09:00,21:00,12��29������1��3���܂ł͕ٓ��B,,,,,,,,,,,,,,,,,,,,,,�ό��U���ۊό��U���W
052027,,�H�c���\��s,���̉w�ӂ���,�~�`�m�G�L�t�^�c�C,,,,,,052027,,�H�c���\��s��c�䒬���q����51,�H�c��,�\��s,��c�䒬���q����,51,,40.216244,140.259702,,,(0185)74-5118,,,,,,,������Г��̉w�ӂ���,�����ΐ��؋��y,09:00,18:00,1��1������1��2���͋x�ٓ��i24���ԗ��p�\�G���A�������j,,,,,,,,,,,,,,,,,,,,,,�������ۑ������W
052027,,�H�c���\��s,�����Z�p�Z���^�[,�\�E�S�E�M�W���c�Z���^�[,,,,,,052027,,�H�c���\��s��c�����q��1-20,�H�c��,�\��s,��c�����q��,1-20,,40.197349,140.070035,,,(0185)58-3068,,,,,,,�E�ƌP���@�l�@�\��E�ƌP������,���ΐ��؋�,09:00,21:00,�j���A12��29������1��3���܂ł͋x�ٓ��B,,,,,,,,,,,,,,,,,,,,,,���H�J���ۏ��H�J���W
052027,,�H�c���\��s,�\��H�ƒc�n�𗬉��,�m�V���R�E�M���E�_���`�R�E�����E�J�C�J��,,,,,,052027,,�H�c���\��s��c���10-2,�H�c��,�\��s,��c���,10-2,,40.198484,140.077856,,,(0185)58-2400,,,,,,,�\��s,���ΐ��؋��y,09:00,21:00,�j���A12��29������1��3���܂ł͋x�ٓ��B,,,,,,,,,,,,,,,,,,,,,,���H�J���ۏ��H�J���W
052027,,�H�c���\��s,������e�̐X,�r�V�������C�R�C�m����,,,,,,052027,,�H�c���\��s��Ք�����127-2,�H�c��,�\��s,��Ք�����,127-2,,,,,,(0185)59-2120,,,,,,,�\��s,�����ΐ��؋��y,00:00,00:00,4��20������11��10���܂ł͕��B,,,,,,,,,,,,,,,,,,,,,,�ыƖ؍ސU���ۗыƖ؍ސU���W
052027,,�H�c���\��s,�\��s�Z�p�J���Z���^�[,�m�V���V�M�W���c�J�C�n�c�Z���^�[,,,,,,052027,,�H�c���\��s�͌ː쎚�쐼�R18-19,�H�c��,�\��s,�͌ː쎚�쐼�R,18-19,,40.176886,140.001669,,,(0185)52-5249,,,,,,,�E�ƌP���@�l�@�\��E�ƌP������,�����ΐ��؋��y,08:00,16:30,��2�E4�E5���j���A�j���A12��29������1��3���܂ł͋x�ٓ��B,,,,,,,,,,,,,,,,,,,,,,�ыƖ؍ސU���ۗыƖ؍ސU���W
052027,,�H�c���\��s,�\��s�؂̊w�Z,�m�V���V�L�m�K�b�R�E,,,,,,052027,,�H�c���\��s�͌ː쎚�쐼�R18-19,�H�c��,�\��s,�͌ː쎚�쐼�R,18-19,,40.176886,140.001669,,,(0185)52-5249,,,,,,,�\��؍ގY�ƘA����,�����ΐ��؋��y,08:00,16:30,��2�E4�E5���j���A�j���A12��29������1��3���܂ł͋x�ٓ��B,,,,,,,,,,,,,,,,,,,,,,�ыƖ؍ސU���ۗыƖ؍ސU���W
